Target
Metabotropic glutamate receptor 2
Ligand
BDBM393765
Substrate
Meas. Tech.
In Vitro GIRK Thallium Flux (2.5 minute) Assay
EC50
>10000±n/a nM
Citation
 Cosford, NDRaveendra-Panickar, DSheffler, DJHutchinson, JHGadient, RA Metabotropic glutamate receptor negative allosteric modulators (NAMs) and uses thereof US Patent  US10597367 Publication Date 3/24/2020 
Target
Name:
Metabotropic glutamate receptor 2
Synonyms:
GRM2_RAT Grm2 | Mglur2
Type:
PROTEIN
Mol. Mass.:
95786.41
Organism:
Rattus norvegicus
Description:
ChEMBL_105034
Residue:
872
  
Inhibitor
Name:
BDBM393765
Synonyms:
US10597367, Example 54 | US9969726, Example 54
Type:
Small organic molecule
Emp. Form.:
C27H21N3
Mol. Mass.:
387.4757
SMILES:
C(c1ccccc1)n1nc(nc1-c1ccccc1)-c1cccc(c1)-c1ccccc1
: