Target
Transient receptor potential cation channel subfamily A member 1
Ligand
BDBM437955
Substrate
Meas. Tech.
FLIPR Tetra Assay
IC50
3.55±n/a nM
Citation
 Verma, VShore, DVolgraf, MEstrada, AALyssikatos, J Bicyclic proline compounds US Patent  US10597383 Publication Date 3/24/2020 
Target
Name:
Transient receptor potential cation channel subfamily A member 1
Synonyms:
hTRPA1
Type:
Protein
Mol. Mass.:
Description:
Components:
This complex has 2 components.
Component 1
Name:
Transient receptor potential cation channel subfamily A member 1
Synonyms:
ANKTM1 TRPA1 Transformation-sensitive protein p120 | Transient receptor potential cation channel subfamily A member 1 (TRPA1)
Type:
Protein
Mol. Mass.:
127514.20
Organism:
Homo sapiens (Human)
Description:
O75762
Residue:
1119
  
Component 2
Name:
Transient receptor potential cation channel subfamily A member 1
Synonyms:
Anktm1 Trpa1
Type:
PROTEIN
Mol. Mass.:
128622.74
Organism:
Rattus norvegicus
Description:
ChEMBL_1450487
Residue:
1125
  
Inhibitor
Name:
BDBM437955
Synonyms:
(2S)-N-[[2-cyclopropyl-6-[2- (trifluoromethyl)pyrimidin-5- yl]-4-pyridyl]methyl]-3-(4- fluorophenyl)sulfonyl-3- azabicyclo[2.1.1]hexane-2- carboxamide | US10597383, Example 33
Type:
Small organic molecule
Emp. Form.:
C26H23F4N5O3S
Mol. Mass.:
561.551
SMILES:
Fc1ccc(cc1)S(=O)(=O)N1C2CC(C2)[C@H]1C(=O)NCc1cc(nc(c1)-c1cnc(nc1)C(F)(F)F)C1CC1
: