Target
Tyrosine-protein kinase HCK
Ligand
BDBM437992
Substrate
Meas. Tech.
In Vitro Activity Assay
IC50
5.33±n/a nM
Citation
 Treon, SPBuhrlage, SJGray, NSTan, LYang, G Methods to treat lymphoplasmacytic lymphoma US Patent  US10597387 Publication Date 3/24/2020 
Target
Name:
Tyrosine-protein kinase HCK
Synonyms:
HCK Hematopoietic cell kinase p59-HCK/p60-HCK p61Hck
Type:
Enzyme Catalytic Domain
Mol. Mass.:
59600.18
Organism:
Homo sapiens (Human)
Description:
P08631
Residue:
526
  
Inhibitor
Name:
BDBM437992
Synonyms:
US10597387, Compound (I-8)
Type:
Small organic molecule
Emp. Form.:
C31H31F3N6O3
Mol. Mass.:
592.6114
SMILES:
CCN1CCN(Cc2ccc(NC(=O)c3ccc(C)c(NC(=O)c4cncc(c4)-c4cnoc4)c3)cc2C(F)(F)F)CC1
: