Target
Poly [ADP-ribose] polymerase 1
Ligand
BDBM438016
Substrate
Meas. Tech.
High-Throughput Screening Assay
IC50
<1.000±n/a nM
Citation
 Zhang, AMiao, ZWang, PSong, SSong, ZHuan, XFan, ZDing, J Substituted triazolopiperazine PARP inhibitor, preparation method therefor and use thereof US Patent  US10597399 Publication Date 3/24/2020 
Target
Name:
Poly [ADP-ribose] polymerase 1
Synonyms:
(ARTD1 or PARP1) 2.4.2.30 ADPRT ARTD1 Human diphtheria toxin-like ADP-ribosyltransferase (ARTD1 or PARP1) NT-PARP-1 PARP1 PPOL Poly [ADP-ribose] polymerase 1 (PARP) Poly [ADP-ribose] polymerase 1 (PARP1) Poly [ADP-ribose] polymerase 1, 28-kDa form Poly [ADP-ribose] polymerase 1, processed C-terminus Poly [ADP-ribose] polymerase-1 Poly(ADP-ribose) polymerase-1 (ARTD1/PARP1) Protein poly-ADP-ribosyltransferase PARP1 | Synonyms=ADPRT
Type:
Mol. Mass.:
113114.22
Organism:
Homo sapiens (Human)
Description:
P09874
Residue:
1014
  
Inhibitor
Name:
BDBM438016
Synonyms:
US10597399, Compound S7
Type:
Small organic molecule
Emp. Form.:
C26H21FN6O2S
Mol. Mass.:
500.547
SMILES:
CC1CN(Cc2nnc(-c3cccs3)n12)C(=O)c1cc(Cc2n[nH]c(=O)c3ccccc23)ccc1F
: