Target
Histamine H3 receptor
Ligand
BDBM438127
Substrate
Meas. Tech.
[35S]-GTPgamma-delta binding assay (antagonist)
IC50
242±n/a nM
Citation
 Xiang, JXu, XFeng, YEng, W Compounds as neuronal histamine receptor-3 antagonists and uses thereof US Patent  US10618886 Publication Date 4/14/2020 
Target
Name:
Histamine H3 receptor
Synonyms:
G-protein coupled receptor 97 HH3R HRH3 Histamine H3 receptor (H3) Histamine receptor (H3 and H4)
Type:
G Protein-Coupled Receptor (GPCR)
Mol. Mass.:
48691.47
Organism:
Homo sapiens (Human)
Description:
Binding assays were using CHO cells stably expressing hH3R receptors.
Residue:
445
  
Inhibitor
Name:
BDBM438127
Synonyms:
US10618886, Compound XXII US11420955, Compound XXII
Type:
Small organic molecule
Emp. Form.:
C27H30F5N3O5S
Mol. Mass.:
603.601
SMILES:
COc1cc(OC2CCN(CC2)C(=O)C2CCOCC2)ccc1-n1c(C)nc2ccc(cc2c1=O)S(F)(F)(F)(F)F
: