Target
Epithelial discoidin domain-containing receptor 1
Ligand
BDBM438274
Substrate
Meas. Tech.
In Vitro Binding Assay for DDR1
IC50
26.8±n/a nM
Citation
 Buettelmann, BKocer, BKuhn, BPrunotto, MRichter, HRitter, M Spiroindolinones as DDR1 inhibitors US Patent  US10618897 Publication Date 4/14/2020 
Target
Name:
Epithelial discoidin domain-containing receptor 1
Synonyms:
CAK DDR1_HUMAN Discoidin domain-containing receptor 1 (DDR1) EDDR1 Epithelial discoidin domain receptor 1 (DDR1) Epithelial discoidin domain-containing receptor 1 (DDR1) Mammary carcinoma kinase 10 NTRK4 Protein-tyrosine kinase RTK 6 TRKE | Tyrosine-protein kinase CAK
Type:
Tyrosine-protein kinase
Mol. Mass.:
101130.02
Organism:
Homo sapiens (Human)
Description:
Q08345
Residue:
913
  
Inhibitor
Name:
BDBM438274
Synonyms:
US10618897, Example 95
Type:
Small organic molecule
Emp. Form.:
C28H27BrF3N5O3
Mol. Mass.:
618.445
SMILES:
FC(F)(F)CC1CCCN1C(=O)CN1C(=O)C2(CCN(CC2)C(=O)c2ccc3[nH]ncc3c2)c2c1cccc2Br
: