Target
Epithelial discoidin domain-containing receptor 1
Ligand
BDBM438321
Substrate
Meas. Tech.
In Vitro Binding Assay for DDR1
IC50
80.4±n/a nM
Citation
 Buettelmann, BKocer, BKuhn, BPrunotto, MRichter, HRitter, M Spiroindolinones as DDR1 inhibitors US Patent  US10618897 Publication Date 4/14/2020 
Target
Name:
Epithelial discoidin domain-containing receptor 1
Synonyms:
CAK DDR1_HUMAN Discoidin domain-containing receptor 1 (DDR1) EDDR1 Epithelial discoidin domain receptor 1 (DDR1) Epithelial discoidin domain-containing receptor 1 (DDR1) Mammary carcinoma kinase 10 NTRK4 Protein-tyrosine kinase RTK 6 TRKE | Tyrosine-protein kinase CAK
Type:
Tyrosine-protein kinase
Mol. Mass.:
101130.02
Organism:
Homo sapiens (Human)
Description:
Q08345
Residue:
913
  
Inhibitor
Name:
BDBM438321
Synonyms:
US10618897, Example 142
Type:
Small organic molecule
Emp. Form.:
C27H27ClFN5O4
Mol. Mass.:
539.986
SMILES:
COC1CCN(C1)C(=O)CN1C(=O)C2(CCN(CC2)C(=O)c2ccc3[nH]ncc3c2)c2c1ccc(F)c2Cl
: