Target
Epithelial discoidin domain-containing receptor 1
Ligand
BDBM438327
Substrate
Meas. Tech.
In Vitro Binding Assay for DDR1
IC50
47.2±n/a nM
Citation
 Buettelmann, BKocer, BKuhn, BPrunotto, MRichter, HRitter, M Spiroindolinones as DDR1 inhibitors US Patent  US10618897 Publication Date 4/14/2020 
Target
Name:
Epithelial discoidin domain-containing receptor 1
Synonyms:
CAK DDR1_HUMAN Discoidin domain-containing receptor 1 (DDR1) EDDR1 Epithelial discoidin domain receptor 1 (DDR1) Epithelial discoidin domain-containing receptor 1 (DDR1) Mammary carcinoma kinase 10 NTRK4 Protein-tyrosine kinase RTK 6 TRKE | Tyrosine-protein kinase CAK
Type:
Tyrosine-protein kinase
Mol. Mass.:
101130.02
Organism:
Homo sapiens (Human)
Description:
Q08345
Residue:
913
  
Inhibitor
Name:
BDBM438327
Synonyms:
US10618897, Example 148
Type:
Small organic molecule
Emp. Form.:
C27H24ClF4N5O3
Mol. Mass.:
577.958
SMILES:
Fc1ccc2N(CC(=O)N3CCC[C@H]3C(F)(F)F)C(=O)C3(CCN(CC3)C(=O)c3ccc4[nH]ncc4c3)c2c1Cl
: