Target
Epithelial discoidin domain-containing receptor 1
Ligand
BDBM438338
Substrate
Meas. Tech.
In Vitro Binding Assay for DDR1
IC50
30.5±n/a nM
Citation
 Buettelmann, BKocer, BKuhn, BPrunotto, MRichter, HRitter, M Spiroindolinones as DDR1 inhibitors US Patent  US10618897 Publication Date 4/14/2020 
Target
Name:
Epithelial discoidin domain-containing receptor 1
Synonyms:
CAK DDR1_HUMAN Discoidin domain-containing receptor 1 (DDR1) EDDR1 Epithelial discoidin domain receptor 1 (DDR1) Epithelial discoidin domain-containing receptor 1 (DDR1) Mammary carcinoma kinase 10 NTRK4 Protein-tyrosine kinase RTK 6 TRKE | Tyrosine-protein kinase CAK
Type:
Tyrosine-protein kinase
Mol. Mass.:
101130.02
Organism:
Homo sapiens (Human)
Description:
Q08345
Residue:
913
  
Inhibitor
Name:
BDBM438338
Synonyms:
US10618897, Example 159
Type:
Small organic molecule
Emp. Form.:
C29H27BrN6O3
Mol. Mass.:
587.467
SMILES:
Brc1cccc2N(CC(=O)N3CCn4cccc4C3)C(=O)C3(CCN(CC3)C(=O)c3ccc4[nH]ncc4c3)c12
: