Target
Metabotropic glutamate receptor 5
Ligand
BDBM438361
Substrate
Meas. Tech.
In Vitro Activity Test for mGluR5
IC50
71320±n/a nM
Citation
 Liu, HZhou, YZhang, DLi, JJiang, HChen, K 5-aromatic alkynyl substituted benzamide compound and preparation method, pharmaceutical composition, and use thereof US Patent  US10618900 Publication Date 4/14/2020 
Target
Name:
Metabotropic glutamate receptor 5
Synonyms:
GPRC1E GRM5_HUMAN metabotropic glutamate 5 | metabotropic glutamate 5a
Type:
Enzyme
Mol. Mass.:
132484.72
Organism:
Homo sapiens (Human)
Description:
Residue:
1212
  
Inhibitor
Name:
BDBM438361
Synonyms:
(2-fluoro-5-(pyridin-2-ylethynyl)phenyl) (1-methyl-3,4-dihydro-isoquinolin-2(1H)- yl)methanone | US10618900, No. ZD048
Type:
Small organic molecule
Emp. Form.:
C24H19FN2O
Mol. Mass.:
370.4189
SMILES:
CC1N(CCc2ccccc12)C(=O)c1cc(ccc1F)C#Cc1ccccn1
: