Target
Metabotropic glutamate receptor 1
Ligand
BDBM438349
Substrate
Meas. Tech.
In Vitro Activity Test for mGluR5
IC50
>100000±n/a nM
Citation
 Liu, HZhou, YZhang, DLi, JJiang, HChen, K 5-aromatic alkynyl substituted benzamide compound and preparation method, pharmaceutical composition, and use thereof US Patent  US10618900 Publication Date 4/14/2020 
Target
Name:
Metabotropic glutamate receptor 1
Synonyms:
GPRC1A GRM1_HUMAN Metabotropic Glutamate 1a | metabotropic glutamate 1
Type:
Enzyme
Mol. Mass.:
132358.19
Organism:
Homo sapiens (Human)
Description:
Q13255
Residue:
1194
  
Inhibitor
Name:
BDBM438349
Synonyms:
2-fluoro-N-(4-fluorophenyl)-5-((2-methyl- thiZaol-4-yl)ethynyl)benzamide | US10618900, No. ZD004
Type:
Small organic molecule
Emp. Form.:
C19H12F2N2OS
Mol. Mass.:
354.373
SMILES:
Cc1nc(cs1)C#Cc1ccc(F)c(c1)C(=O)Nc1ccc(F)cc1
: