Target
Kappa-type opioid receptor
Ligand
BDBM156453
Substrate
Meas. Tech.
enzyme assay
IC50
4.00±n/a nM
Citation
 Roberts, EGuerrero, MAUrbano, MRosen, H Kappa opioid ligands US Patent  US10118915 Publication Date 11/6/2018 
Target
Name:
Kappa-type opioid receptor
Synonyms:
K-OR-1 Kappa-opioid receptor (KOR) Kappa-type opioid receptor (KOR) OPIATE Kappa OPRK1 kappa opioid receptor (KOR)
Type:
G Protein-Coupled Receptor (GPCR)
Mol. Mass.:
42648.76
Organism:
Homo sapiens (Human)
Description:
P41145
Residue:
380
  
Inhibitor
Name:
BDBM156453
Synonyms:
US10118915, Compound 247 | US9682966, 247
Type:
Small organic molecule
Emp. Form.:
C23H29N5O2
Mol. Mass.:
407.5087
SMILES:
Cc1noc(n1)-c1cc2cc(C)ccc2nc1N1CCC(CC1)NC1CCCOC1
: