Target
Kappa-type opioid receptor
Ligand
BDBM156529
Substrate
Meas. Tech.
enzyme assay
IC50
1.50±n/a nM
Citation
 Roberts, EGuerrero, MAUrbano, MRosen, H Kappa opioid ligands US Patent  US10118915 Publication Date 11/6/2018 
Target
Name:
Kappa-type opioid receptor
Synonyms:
K-OR-1 Kappa-opioid receptor (KOR) Kappa-type opioid receptor (KOR) OPIATE Kappa OPRK1 kappa opioid receptor (KOR)
Type:
G Protein-Coupled Receptor (GPCR)
Mol. Mass.:
42648.76
Organism:
Homo sapiens (Human)
Description:
P41145
Residue:
380
  
Inhibitor
Name:
BDBM156529
Synonyms:
US10118915, Compound 313 | US9682966, 313
Type:
Small organic molecule
Emp. Form.:
C27H37N5O2
Mol. Mass.:
463.615
SMILES:
CCc1noc(n1)-c1cc2cc(C)ccc2nc1N1CCC(NC2CCCCCC2)C(C1)OC
: