Target
Kappa-type opioid receptor
Ligand
BDBM156547
Substrate
Meas. Tech.
enzyme assay
IC50
0.720±n/a nM
Citation
 Roberts, EGuerrero, MAUrbano, MRosen, H Kappa opioid ligands US Patent  US10118915 Publication Date 11/6/2018 
Target
Name:
Kappa-type opioid receptor
Synonyms:
K-OR-1 Kappa-opioid receptor (KOR) Kappa-type opioid receptor (KOR) OPIATE Kappa OPRK1 kappa opioid receptor (KOR)
Type:
G Protein-Coupled Receptor (GPCR)
Mol. Mass.:
42648.76
Organism:
Homo sapiens (Human)
Description:
P41145
Residue:
380
  
Inhibitor
Name:
BDBM156547
Synonyms:
US10118915, Compound 328 | US9682966, 328
Type:
Small organic molecule
Emp. Form.:
C25H33N5O2
Mol. Mass.:
435.5618
SMILES:
Cc1nc(no1)-c1cc2cc(C)ccc2nc1N1CCC(NC2CCCCC2)C(CO)C1
: