Target
Kappa-type opioid receptor
Ligand
BDBM156570
Substrate
Meas. Tech.
enzyme assay
IC50
0.970±n/a nM
Citation
 Roberts, EGuerrero, MAUrbano, MRosen, H Kappa opioid ligands US Patent  US10118915 Publication Date 11/6/2018 
Target
Name:
Kappa-type opioid receptor
Synonyms:
K-OR-1 Kappa-opioid receptor (KOR) Kappa-type opioid receptor (KOR) OPIATE Kappa OPRK1 kappa opioid receptor (KOR)
Type:
G Protein-Coupled Receptor (GPCR)
Mol. Mass.:
42648.76
Organism:
Homo sapiens (Human)
Description:
P41145
Residue:
380
  
Inhibitor
Name:
BDBM156570
Synonyms:
US10118915, Compound 350 | US9682966, 350
Type:
Small organic molecule
Emp. Form.:
C25H33N5O
Mol. Mass.:
419.5624
SMILES:
CC1CCC(CC1)NC1CCN(CC1)c1nc2ccc(C)cc2cc1-c1nc(C)no1
: