Target
Interleukin-1 receptor-associated kinase 4
Ligand
BDBM438635
Substrate
Meas. Tech.
IRAK4 Inhibition Assay
IC50
2.00±n/a nM
Citation
 Duncia, JVGardner, DSHynes, JMacor, JEMurugesan, NSantella, JBWu, HKantheti, DNair, SKPaidi, VRKumar, SRSarkunam, KSistla, RKPolimera, SR Heteroaryl substituted aminopyridine compounds US Patent  US10618903 Publication Date 4/14/2020 
Target
Name:
Interleukin-1 receptor-associated kinase 4
Synonyms:
IRAK-4 IRAK4_HUMAN Interleukin-1 receptor-associated kinase 4 (IRAK4) | Renal carcinoma antigen NY-REN-64
Type:
Protein
Mol. Mass.:
51519.08
Organism:
Homo sapiens (Human)
Description:
Q9NWZ3
Residue:
460
  
Inhibitor
Name:
BDBM438635
Synonyms:
US10618903, Example 202
Type:
Small organic molecule
Emp. Form.:
C21H26ClFN6O2
Mol. Mass.:
448.922
SMILES:
CC[C@@H](C)Nc1cc(ncc1C(=O)NC[C@@H](F)C(C)(C)O)-c1cnc2cc(Cl)cnn12
: