Target
Dual specificity calcium/calmodulin-dependent 3',5'-cyclic nucleotide phosphodiesterase 1C
Ligand
BDBM279018
Substrate
Meas. Tech.
PDE1 Inhibition Assay
IC50
170±n/a nM
Citation
 Juhl, KJessing, MLanggård, MVital, PJKehler, JRasmussen, LKClementson, CMMarigo, M Macrocycles as PDE1 inhibitors US Patent  US10618913 Publication Date 4/14/2020 
Target
Name:
Dual specificity calcium/calmodulin-dependent 3',5'-cyclic nucleotide phosphodiesterase 1C
Synonyms:
3',5'-cyclic-AMP phosphodiesterase Calcium/calmodulin-dependent 3',5'-cyclic nucleotide phosphodiesterase 1C Hcam3 PDE1C_HUMAN Phosphodiesterase 1C | Phosphodiesterase, PDE1/PDE5
Type:
Enzyme
Mol. Mass.:
80778.58
Organism:
Homo sapiens (Human)
Description:
Q14123
Residue:
709
  
Inhibitor
Name:
BDBM279018
Synonyms:
5-(2-ethoxypyridin-3-yl)-1-ethyl-3-methyl-N-((1-methyl-1H-pyrazol-4-yl)methyl)-1H-pyrazolo[4,3-b]pyridin-7-amine US10512632, Example 48 US10766893, Example S48 US11026923, Example 48 US11634416, Example 48
Type:
Small organic molecule
Emp. Form.:
C21H25N7O
Mol. Mass.:
391.4695
SMILES:
CCOc1ncccc1-c1cc(NCc2cnn(C)c2)c2n(CC)nc(C)c2n1
: