Target
Dual specificity calcium/calmodulin-dependent 3',5'-cyclic nucleotide phosphodiesterase 1B
Ligand
BDBM279137
Substrate
Meas. Tech.
PDE1 Inhibition Assay
IC50
2.60±n/a nM
Citation
 Juhl, KJessing, MLanggård, MVital, PJKehler, JRasmussen, LKClementson, CMMarigo, M Macrocycles as PDE1 inhibitors US Patent  US10618913 Publication Date 4/14/2020 
Target
Name:
Dual specificity calcium/calmodulin-dependent 3',5'-cyclic nucleotide phosphodiesterase 1B
Synonyms:
63 kDa Cam-PDE Calcium/calmodulin-dependent 3',5'-cyclic nucleotide phosphodiesterase 1B PDE1B PDE1B_HUMAN Phosphodiesterase 1B Phosphodiesterase Type 1 (PDE1B) | Phosphodiesterase, PDE1/PDE5
Type:
Enzyme
Mol. Mass.:
61366.51
Organism:
Homo sapiens (Human)
Description:
Residue:
536
  
Inhibitor
Name:
BDBM279137
Synonyms:
1-isopropyl-3-methyl-N-[(1-methylpyrazol-4-yl)methyl]-5-oxazol-2-yl-pyrazolo[4,3-b]pyridin-7-amine US10512632, Example 168 US10766893, Example S168 US11026923, Example 168 US11634416, Example 168
Type:
Small organic molecule
Emp. Form.:
C18H21N7O
Mol. Mass.:
351.4056
SMILES:
CC(C)n1nc(C)c2nc(cc(NCc3cnn(C)c3)c12)-c1ncco1
: