Target
Signal transducer and activator of transcription 3
Ligand
BDBM438761
Substrate
Meas. Tech.
Bioassay Evaluation
IC50
27560±n/a nM
Citation
 Huryn, DMWipf, PGrandis, JRLaPorte, MGJohnston, PASchurdak, MEColombo, R 6-aryl-7-substituted-3-(1H-pyrazol-5-yl)-7H-[1,2,4]triazolo[3,4-B][1,3,4]thiadiazines as inhibitors of the STAT3 pathway with anti-proliferative activity US Patent  US10618914 Publication Date 4/14/2020 
Target
Name:
Signal transducer and activator of transcription 3
Synonyms:
APRF STAT3_HUMAN Signal transducer and activator of transcription 3 (STAT3)
Type:
Protein
Mol. Mass.:
88064.31
Organism:
Homo sapiens (Human)
Description:
P40763
Residue:
770
  
Inhibitor
Name:
BDBM438761
Synonyms:
US10618914, Compound UPCDC10352 | US11111253, Compound UPCDC10352
Type:
Small organic molecule
Emp. Form.:
C18H16N4OS
Mol. Mass.:
336.411
SMILES:
COc1ccc(cc1)C1=Nn2c(SC1C)nnc2-c1ccccc1
: