Target
Signal transducer and activator of transcription 3
Ligand
BDBM50189936
Substrate
Meas. Tech.
Bioassay Evaluation
IC50
>50000±n/a nM
Citation
 Huryn, DMWipf, PGrandis, JRLaPorte, MGJohnston, PASchurdak, MEColombo, R 6-aryl-7-substituted-3-(1H-pyrazol-5-yl)-7H-[1,2,4]triazolo[3,4-B][1,3,4]thiadiazines as inhibitors of the STAT3 pathway with anti-proliferative activity US Patent  US10618914 Publication Date 4/14/2020 
Target
Name:
Signal transducer and activator of transcription 3
Synonyms:
APRF STAT3_HUMAN Signal transducer and activator of transcription 3 (STAT3)
Type:
Protein
Mol. Mass.:
88064.31
Organism:
Homo sapiens (Human)
Description:
P40763
Residue:
770
  
Inhibitor
Name:
BDBM50189936
Synonyms:
CHEMBL3827729 US11111253, Compound 11b
Type:
Small organic molecule
Emp. Form.:
C13H10N6S
Mol. Mass.:
282.324
SMILES:
C1Sc2nnc(-c3cc(n[nH]3)-c3ccccc3)n2N=C1
: