Target
Programmed cell death 1 ligand 1 [19-238]/protein 1 [25-167]
Ligand
BDBM438797
Substrate
Meas. Tech.
Homogeneous Time-Resolved Fluorescence (HTRF) PD-1/PD-L1 Binding Assay
IC50
<5±n/a nM
Citation
 Wu, LXiao, KYao, W Heterocyclic compounds as immunomodulators US Patent  US10618916 Publication Date 4/14/2020 
Target
Name:
Programmed cell death 1 ligand 1 [19-238]/protein 1 [25-167]
Synonyms:
PD-1/PD-L1
Type:
Protein
Mol. Mass.:
Description:
Components:
This complex has 2 components.
Component 1
Name:
Programmed cell death protein 1 [25-167]
Synonyms:
PD1 PDCD1_HUMAN Programmed cell death protein 1 (aa25-167) hPD-1
Type:
Enzyme Catalytic Domain
Mol. Mass.:
15954.64
Organism:
Homo sapiens (Human)
Description:
Q15116 (aa25-167)
Residue:
143
  
Component 2
Name:
Programmed cell death 1 ligand 1 [19-238]
Synonyms:
B7H1 PD-L1 PDCD1 ligand 1 PDCD1LG1 Programmed cell death 1 ligand 1 (aa19-238) hPD-L1
Type:
Enzyme Catalytic Domain
Mol. Mass.:
25191.31
Organism:
Homo sapiens (Human)
Description:
Q9NZQ7 (aa19-238)
Residue:
220
  
Inhibitor
Name:
BDBM438797
Synonyms:
(S)-4-(2-(2-((2-chloro-3'-(5- (2-hydroxypropyl)-1- methyl-4,5,6,7-tetrahydro- 1H-imidazo[4,5-c]pyridine- 2-carboxamido)-2'-methyl- [1,1'-biphenyl]-3- yl)carbamoyl)-1-methyl- 1,4,6,7-tetrahydro-5H- imidazo[4,5-c]pyridin-5- yl)ethyl)bicyclo[2.2.1] heptane-1-carboxylic acid US10906920, Example 32 | US11414433, Example 32
Type:
Small organic molecule
Emp. Form.:
C42H51ClN8O5
Mol. Mass.:
783.358
SMILES:
C[C@H](O)CN1CCc2c(C1)nc(C(=O)Nc1cccc(c1C)-c1cccc(NC(=O)c3nc4CN(CCC56CCC(CC5)(C6)C(O)=O)CCc4n3C)c1Cl)n2C
: