Target
Programmed cell death 1 ligand 1 [19-238]/protein 1 [25-167]
Ligand
BDBM438827
Substrate
Meas. Tech.
Homogeneous Time-Resolved Fluorescence (HTRF) PD-1/PD-L1 Binding Assay
IC50
<5±n/a nM
Citation
 Wu, LXiao, KYao, W Heterocyclic compounds as immunomodulators US Patent  US10618916 Publication Date 4/14/2020 
Target
Name:
Programmed cell death 1 ligand 1 [19-238]/protein 1 [25-167]
Synonyms:
PD-1/PD-L1
Type:
Protein
Mol. Mass.:
Description:
Components:
This complex has 2 components.
Component 1
Name:
Programmed cell death protein 1 [25-167]
Synonyms:
PD1 PDCD1_HUMAN Programmed cell death protein 1 (aa25-167) hPD-1
Type:
Enzyme Catalytic Domain
Mol. Mass.:
15954.64
Organism:
Homo sapiens (Human)
Description:
Q15116 (aa25-167)
Residue:
143
  
Component 2
Name:
Programmed cell death 1 ligand 1 [19-238]
Synonyms:
B7H1 PD-L1 PDCD1 ligand 1 PDCD1LG1 Programmed cell death 1 ligand 1 (aa19-238) hPD-L1
Type:
Enzyme Catalytic Domain
Mol. Mass.:
25191.31
Organism:
Homo sapiens (Human)
Description:
Q9NZQ7 (aa19-238)
Residue:
220
  
Inhibitor
Name:
BDBM438827
Synonyms:
US10618916, Example 61-(compound-1) US11414433, Example 61
Type:
Small organic molecule
Emp. Form.:
C45H55ClN8O5
Mol. Mass.:
823.422
SMILES:
Cc1c(NC(=O)c2nc3CN(CCc3n2C)C2CCC(O)CC2)cccc1-c1cccc(NC(=O)c2nc3CN(CCC45CCC(CC4)(C5)C(O)=O)CCc3n2C)c1Cl
: