Target
Toll-like receptor 7
Ligand
BDBM278956
Substrate
Meas. Tech.
HEK293-Blue-hTLR-7 Cells Assay
EC50
12000±n/a nM
Citation
 Chen, DFeng, SGao, LLi, CWang, BWang, LYun, HZheng, X 3-substituted 5-amino-6H-thiazolo[4,5-D]pyrimidine-2, 7-dione compounds for the treatment and prophylaxis of virus infection US Patent  US10618929 Publication Date 4/14/2020 
Target
Name:
Toll-like receptor 7
Synonyms:
ORF Names:UNQ248/PRO285 TLR7_HUMAN | Toll-like receptor 7 (TLR7)
Type:
Enzyme
Mol. Mass.:
120945.35
Organism:
Homo sapiens (Human)
Description:
Q9NYK1
Residue:
1049
  
Inhibitor
Name:
BDBM278956
Synonyms:
US10040815, Example 18-A | US10618929, Example 18-A
Type:
Small organic molecule
Emp. Form.:
C12H12N4O5S
Mol. Mass.:
324.312
SMILES:
Nc1nc2n([C@@H]3O[C@@H](C[C@H]3O)C(O)C#C)c(=O)sc2c(=O)[nH]1
: