Target
Toll-like receptor 7
Ligand
BDBM278970
Substrate
Meas. Tech.
HEK293-Blue-hTLR-7 Cells Assay
EC50
51000±n/a nM
Citation
 Chen, DFeng, SGao, LLi, CWang, BWang, LYun, HZheng, X 3-substituted 5-amino-6H-thiazolo[4,5-D]pyrimidine-2, 7-dione compounds for the treatment and prophylaxis of virus infection US Patent  US10618929 Publication Date 4/14/2020 
Target
Name:
Toll-like receptor 7
Synonyms:
ORF Names:UNQ248/PRO285 TLR7_HUMAN | Toll-like receptor 7 (TLR7)
Type:
Enzyme
Mol. Mass.:
120945.35
Organism:
Homo sapiens (Human)
Description:
Q9NYK1
Residue:
1049
  
Inhibitor
Name:
BDBM278970
Synonyms:
US10040815, Example 42 [(1S)-1-[(2S,4R,5R)-5-(5-Amino-2,7-dioxo-6H-thiazolo[4,5-d]pyrimidin-3-yl)-4-hydroxy-tetrahydrofuran-2-yl]propyl] 2-methylpropanoate
Type:
Small organic molecule
Emp. Form.:
C16H22N4O6S
Mol. Mass.:
398.434
SMILES:
CC[C@H](OC(=O)C(C)C)[C@@H]1C[C@@H](O)[C@@H](O1)n1c2nc(N)[nH]c(=O)c2sc1=O
: