Target
Beta-secretase 1
Ligand
BDBM230871
Substrate
Meas. Tech.
Binding Assay
Ki
7.40±n/a nM
Citation
 Juhl, KTagmose, LMarigo, M 2-amino-6-(difluoromethyl)-5,5-difluoro-6-phenyl-3,4,5,6-tetrahydropyridines as BACE1 inhibitors US Patent  US10603310 Publication Date 3/31/2020 
Target
Name:
Beta-secretase 1
Synonyms:
ASP2 Aspartyl protease 2 BACE1 Beta-secretase (BACE) Beta-secretase 1 (BACE 1) Beta-secretase 1 (BACE1) Beta-site amyloid precursor protein cleaving enzyme 1 Memapsin-2 beta-Secretase (BACE-1) | beta-Secretase (BACE1)
Type:
Protein
Mol. Mass.:
55755.10
Organism:
Homo sapiens (Human)
Description:
P56817
Residue:
501
  
Inhibitor
Name:
BDBM230871
Synonyms:
US10045974, 7 US9346797, 7
Type:
Small organic molecule
Emp. Form.:
C19H14F5N5O
Mol. Mass.:
423.3394
SMILES:
NC1=N[C@](C(F)F)(c2cc(NC(=O)c3ccc(cn3)C#N)ccc2F)C(F)(F)CC1
: