Target
Cyclin-A2/Cyclin-dependent kinase 2
Ligand
BDBM7127
Substrate
Histone H1
Meas. Tech.
Kinase SPA Assay
pH
7.4±n/a
Temperature
295.15±n/a K
IC50
290±n/a nM
Citation
 Pevarello, PBrasca, MGAmici, ROrsini, PTraquandi, GCorti, LPiutti, CSansonna, PVilla, MPierce, BSPulici, MGiordano, PMartina, KFritzen, ELNugent, RACasale, ECameron, ACiomei, MRoletto, FIsacchi, AFogliatto, GPesenti, EPastori, WMarsiglio, ALeach, KLClare, PMFiorentini, FVarasi, MVulpetti, AWarpehoski, MA 3-Aminopyrazole inhibitors of CDK2/cyclin A as antitumor agents. 1. Lead finding. J Med Chem 47:3367-80 (2004)  
Target
Name:
Cyclin-A2/Cyclin-dependent kinase 2
Synonyms:
CDK2-CyclinA CDK2/Cyclin A Cyclin A2/dependent kinase 2 Cyclin-Dependent Kinase 2 (CDK2A)
Type:
Protein Complex
Mol. Mass.:
Description:
Cdk2/Cyclin A kinase was purified from insect cells coinfected with Cyclin A/Cdk2 baculovirus.
Components:
This complex has 2 components.
Component 1
Name:
Cyclin-dependent kinase 2
Synonyms:
CDK2 CDK2_HUMAN Cell division protein kinase 2 Protein cereblon/Cyclin-dependent kinase 2 | p33 protein kinase
Type:
Enzyme Subunit
Mol. Mass.:
33938.17
Organism:
Homo sapiens (Human)
Description:
P24941
Residue:
298
  
Component 2
Name:
Cyclin-A2
Synonyms:
CCN1 CCNA1 CCNA2_HUMAN Cyclin-A
Type:
Enzyme Subunit
Mol. Mass.:
48550.19
Organism:
Homo sapiens (Human)
Description:
P20248
Residue:
432
  
Inhibitor
Name:
BDBM7127
Synonyms:
3-Benzamidoaminopyrazole deriv. 4 N-(5-cyclopropyl-1H-pyrazol-3-yl)benzamide
Type:
Small organic molecule
Emp. Form.:
C13H13N3O
Mol. Mass.:
227.2618
SMILES:
O=C(Nc1cc(n[nH]1)C1CC1)c1ccccc1
:
Substrate
Name:
Histone H1
Synonyms:
Type:
Other Protein Type
Mol. Mass.:
358.43
Organism:
Bos taurus (bovine)
Description:
Residue:
3
NA