Target
Arginase-1
Ligand
BDBM290366
Substrate
Meas. Tech.
Inhibition Assay
IC50
5000±n/a nM
Citation
 Van Zandt, MJagdmann, GE Arginase inhibitors as therapeutics US Patent  US10603330 Publication Date 3/31/2020 
Target
Name:
Arginase-1
Synonyms:
ARG1 Liver-type arginase | Type I arginase
Type:
PROTEIN
Mol. Mass.:
34737.53
Organism:
Homo sapiens (Human)
Description:
ChEMBL_978893
Residue:
322
  
Inhibitor
Name:
BDBM290366
Synonyms:
(1S,2R)-1-amino-2-(3-boronopropyl)cyclopentanecarboxylic acid US10603330, Example 2 | US11389464, Example 2
Type:
Small organic molecule
Emp. Form.:
C9H18BNO4
Mol. Mass.:
215.055
SMILES:
N[C@]1(CCC[C@H]1CCCB(O)O)C(O)=O
: