Target
Arginase-1
Ligand
BDBM290371
Substrate
Meas. Tech.
Inhibition Assay
IC50
2000±n/a nM
Citation
 Van Zandt, MJagdmann, GE Arginase inhibitors as therapeutics US Patent  US10603330 Publication Date 3/31/2020 
Target
Name:
Arginase-1
Synonyms:
ARG1 Liver-type arginase | Type I arginase
Type:
PROTEIN
Mol. Mass.:
34737.53
Organism:
Homo sapiens (Human)
Description:
ChEMBL_978893
Residue:
322
  
Inhibitor
Name:
BDBM290371
Synonyms:
(3S,4S)-4-amino-3-(3-boronopropyl)piperidine-4-carboxylic acid US10603330, Example 7 | US11389464, Example 7
Type:
Small organic molecule
Emp. Form.:
C9H19BN2O4
Mol. Mass.:
230.069
SMILES:
N[C@]1(CCNC[C@@H]1CCCB(O)O)C(O)=O
: