Target
Arginase-1
Ligand
BDBM438860
Substrate
Meas. Tech.
Inhibition Assay
IC50
2000±n/a nM
Citation
 Van Zandt, MJagdmann, GE Arginase inhibitors as therapeutics US Patent  US10603330 Publication Date 3/31/2020 
Target
Name:
Arginase-1
Synonyms:
ARG1 Liver-type arginase | Type I arginase
Type:
PROTEIN
Mol. Mass.:
34737.53
Organism:
Homo sapiens (Human)
Description:
ChEMBL_978893
Residue:
322
  
Inhibitor
Name:
BDBM438860
Synonyms:
(3R,4S)-3-amino-4-(3-boronopropyl)-1-(7H-purin-6-yl)pyrrolidine- 3-carboxylic acid | US10603330, Example 23
Type:
Small organic molecule
Emp. Form.:
C14H20BN5O4
Mol. Mass.:
333.151
SMILES:
N[C@]1(CC(C[C@@H]1CCCB(O)O)c1ncnc2nc[nH]c12)C(O)=O
: