Target
Arginase-2, mitochondrial
Ligand
BDBM290404
Substrate
Meas. Tech.
Inhibition Assay
IC50
1000±n/a nM
Citation
 Van Zandt, MJagdmann, GE Arginase inhibitors as therapeutics US Patent  US10603330 Publication Date 3/31/2020 
Target
Name:
Arginase-2, mitochondrial
Synonyms:
ARG2 Arginase II Non-hepatic arginase | Type II arginase
Type:
PROTEIN
Mol. Mass.:
38576.93
Organism:
Homo sapiens (Human)
Description:
ChEMBL_978892
Residue:
354
  
Inhibitor
Name:
BDBM290404
Synonyms:
(3R,4S)-3-amino-1-(2-(benzylamino)ethyl)-4-(3- boronopropyl)pyrrolidine-3-carboxylic acid US10603330, Example 40 | US11389464, Example 40
Type:
Small organic molecule
Emp. Form.:
C17H28BN3O4
Mol. Mass.:
349.233
SMILES:
N[C@]1(CN(CCNCc2ccccc2)C[C@@H]1CCCB(O)O)C(O)=O
: