Target
Mu-type opioid receptor
Ligand
BDBM438970
Substrate
Meas. Tech.
Competitive Displacement Assay
Ki
3±n/a nM
Citation
 Wynn, TAAlvarez, JCMoustakas, DTHaeberlein, MPennington, LD Compounds for the treatment of pain US Patent  US10604489 Publication Date 3/31/2020 
Target
Name:
Mu-type opioid receptor
Synonyms:
M-OR-1 MOR-1 MUOR1 Mu opiate receptor OPRM1 hMOP | mu-type opioid receptor isoform MOR-1
Type:
G Protein-Coupled Receptor (GPCR)
Mol. Mass.:
44789.51
Organism:
Homo sapiens (Human)
Description:
P35372
Residue:
400
  
Inhibitor
Name:
BDBM438970
Synonyms:
US10604489, Compound 131
Type:
Small organic molecule
Emp. Form.:
C20H29N3O2
Mol. Mass.:
343.4632
SMILES:
COC1(C2CCCC1CN(C2)C1C[C@H](C)C1)c1ccnc(c1)C(N)=O
: