Target
Lysine-specific histone demethylase 1A
Ligand
BDBM439025
Substrate
Meas. Tech.
FL-LSD1 LC-MS Assay
IC50
30.0±n/a nM
Citation
 Du-Cuny, LXiao, QXun, GZheng, Q Substituted 5-cyanoindole compounds and uses thereof US Patent  US10604502 Publication Date 3/31/2020 
Target
Name:
Lysine-specific histone demethylase 1A
Synonyms:
AOF2 Flavin-containing amine oxidase domain-containing protein 2 KDM1A KIAA0601 Lysine-specific demethylase 1 (LSD1) Lysine-specific histone demethylase 1 (LSD1)
Type:
Enzyme
Mol. Mass.:
92901.01
Organism:
Homo sapiens (Human)
Description:
O60341
Residue:
852
  
Inhibitor
Name:
BDBM439025
Synonyms:
US10604502, Ex # 13
Type:
Small organic molecule
Emp. Form.:
C19H17ClN4O
Mol. Mass.:
352.817
SMILES:
Cc1cc2n(cc(-c3cncc(N)c3Cl)c2cc1C#N)[C@H]1C[C@H](O)C1
: