Target
Lysine-specific histone demethylase 1A
Ligand
BDBM439062
Substrate
Meas. Tech.
FL-LSD1 LC-MS Assay
IC50
14.0±n/a nM
Citation
 Du-Cuny, LXiao, QXun, GZheng, Q Substituted 5-cyanoindole compounds and uses thereof US Patent  US10604502 Publication Date 3/31/2020 
Target
Name:
Lysine-specific histone demethylase 1A
Synonyms:
AOF2 Flavin-containing amine oxidase domain-containing protein 2 KDM1A KIAA0601 Lysine-specific demethylase 1 (LSD1) Lysine-specific histone demethylase 1 (LSD1)
Type:
Enzyme
Mol. Mass.:
92901.01
Organism:
Homo sapiens (Human)
Description:
O60341
Residue:
852
  
Inhibitor
Name:
BDBM439062
Synonyms:
US10604502, Ex # 50
Type:
Small organic molecule
Emp. Form.:
C22H22ClN5O2
Mol. Mass.:
423.895
SMILES:
COC(=O)N1CCC(CC1)n1cc(-c2cncc(N)c2Cl)c2cc(C#N)c(C)cc12
: