Target
Tyrosine-protein kinase BTK
Ligand
BDBM165319
Substrate
Meas. Tech.
Enzyme Assay
IC50
0.140±n/a nM
Citation
 Liu, QWatterson, SHMacor, JENgu, KAhmad, S Indole carboxamide compounds US Patent  US10604504 Publication Date 3/31/2020 
Target
Name:
Tyrosine-protein kinase BTK
Synonyms:
AGMX1 Agammaglobulinaemia tyrosine kinase B cell progenitor kinase BPK BTK_HUMAN Tyrosine Kinase BTK Tyrosine-protein kinase BTK (BTK)
Type:
Enzyme
Mol. Mass.:
76289.95
Organism:
Homo sapiens (Human)
Description:
Q06187
Residue:
659
  
Inhibitor
Name:
BDBM165319
Synonyms:
US10604504, Example 115 US9688629, 115 US9920031, Example 115
Type:
Small organic molecule
Emp. Form.:
C19H22N4O2
Mol. Mass.:
338.4036
SMILES:
Cc1[nH]c2c(ccc(N3CCC[C@@H](C3)NC(=O)C#C)c2c1C)C(N)=O
: