Target
Tyrosine-protein kinase BTK
Ligand
BDBM166761
Substrate
Meas. Tech.
Enzyme Assay
IC50
0.200±n/a nM
Citation
 Liu, QWatterson, SHMacor, JENgu, KAhmad, S Indole carboxamide compounds US Patent  US10604504 Publication Date 3/31/2020 
Target
Name:
Tyrosine-protein kinase BTK
Synonyms:
AGMX1 Agammaglobulinaemia tyrosine kinase B cell progenitor kinase BPK BTK_HUMAN Tyrosine Kinase BTK Tyrosine-protein kinase BTK (BTK)
Type:
Enzyme
Mol. Mass.:
76289.95
Organism:
Homo sapiens (Human)
Description:
Q06187
Residue:
659
  
Inhibitor
Name:
BDBM166761
Synonyms:
US10604504, Example 224 US9688629, 224 US9920031, Example 224
Type:
Small organic molecule
Emp. Form.:
C23H22IN3O2
Mol. Mass.:
499.3442
SMILES:
Cc1[nH]c2c(cc(I)c(-c3cccc4CN(CCc34)C(=O)C=C)c2c1C)C(N)=O
: