Target
Dual specificity tyrosine-phosphorylation-regulated kinase 1A
Ligand
BDBM439136
Substrate
Meas. Tech.
Kinase Assay
EC50
16.0±n/a nM
Citation
 KC, SKMittapalli, GKChiruta, CHofilena, BJMak, CCEastman, BWBollu, V 6-(5-membered heteroaryl)isoquinolin-3-yl carboxamides and preparation and use thereof US Patent  US10604514 Publication Date 3/31/2020 
Target
Name:
Dual specificity tyrosine-phosphorylation-regulated kinase 1A
Synonyms:
DYR1A_HUMAN DYRK1A Dual specificity YAK1-related kinase 1A (Dyrk1A) Dual-specificity tyrosine-phosphorylation regulated kinase 1A HP86 MNBH
Type:
Enzyme
Mol. Mass.:
85616.61
Organism:
Homo sapiens (Human)
Description:
Q13627
Residue:
763
  
Inhibitor
Name:
BDBM439136
Synonyms:
US10604514, Compound 12
Type:
Small organic molecule
Emp. Form.:
C25H31N5O2
Mol. Mass.:
433.5459
SMILES:
CN1CCN(CC1)[C@H]1CC[C@@H](CC1)C(=O)Nc1cc2cc(ccc2cn1)-c1coc(C)n1
: