Target
Dual specificity tyrosine-phosphorylation-regulated kinase 1A
Ligand
BDBM439178
Substrate
Meas. Tech.
Kinase Assay
EC50
7.00±n/a nM
Citation
 KC, SKMittapalli, GKChiruta, CHofilena, BJMak, CCEastman, BWBollu, V 6-(5-membered heteroaryl)isoquinolin-3-yl carboxamides and preparation and use thereof US Patent  US10604514 Publication Date 3/31/2020 
Target
Name:
Dual specificity tyrosine-phosphorylation-regulated kinase 1A
Synonyms:
DYR1A_HUMAN DYRK1A Dual specificity YAK1-related kinase 1A (Dyrk1A) Dual-specificity tyrosine-phosphorylation regulated kinase 1A HP86 MNBH
Type:
Enzyme
Mol. Mass.:
85616.61
Organism:
Homo sapiens (Human)
Description:
Q13627
Residue:
763
  
Inhibitor
Name:
BDBM439178
Synonyms:
US10604514, Compound 54
Type:
Small organic molecule
Emp. Form.:
C20H24N6O2
Mol. Mass.:
380.4436
SMILES:
COC1CCN(CC(=O)Nc2cc3cc(ccc3cn2)-c2cn(C)nn2)CC1
: