Target
Dual specificity tyrosine-phosphorylation-regulated kinase 1A
Ligand
BDBM293657
Substrate
Meas. Tech.
Kinase Assay
EC50
6.00±n/a nM
Citation
 KC, SKMittapalli, GKChiruta, CHofilena, BJMak, CCEastman, BWBollu, V 6-(5-membered heteroaryl)isoquinolin-3-yl carboxamides and preparation and use thereof US Patent  US10604514 Publication Date 3/31/2020 
Target
Name:
Dual specificity tyrosine-phosphorylation-regulated kinase 1A
Synonyms:
DYR1A_HUMAN DYRK1A Dual specificity YAK1-related kinase 1A (Dyrk1A) Dual-specificity tyrosine-phosphorylation regulated kinase 1A HP86 MNBH
Type:
Enzyme
Mol. Mass.:
85616.61
Organism:
Homo sapiens (Human)
Description:
Q13627
Residue:
763
  
Inhibitor
Name:
BDBM293657
Synonyms:
US10106527, Compound 464 US10604514, Compound 77 US20230286945, Compound 464 | US9951048, Compound 464
Type:
Small organic molecule
Emp. Form.:
C24H24N6O
Mol. Mass.:
412.487
SMILES:
Cc1ncc(-c2ccc3cnc(NC(=O)c4ccnc(c4)N4CCCC4)cc3c2)n1C
: