Target
Histone-lysine N-methyltransferase EZH2
Ligand
BDBM439129
Substrate
Meas. Tech.
Scintillation Proximity Assay
IC50
<10.00±n/a nM
Citation
 Knight, SDLafrance, III, LVTian, X Enhancer of zeste homolog 2 inhibitors US Patent  US10604531 Publication Date 3/31/2020 
Target
Name:
Histone-lysine N-methyltransferase EZH2
Synonyms:
ENX-1 EZH2_HUMAN Histone-lysine N-methyltransferase EZH2 Lysine N-methyltransferase 6
Type:
Protein
Mol. Mass.:
85367.84
Organism:
Homo sapiens (Human)
Description:
Q15910
Residue:
746
  
Inhibitor
Name:
BDBM439129
Synonyms:
(R)-5-((4,6-Dimethyl-2-oxo-1,2-dihydropyridin-3-yl)methyl)-3-methyl-2-(1-(1-neopentylpiperidin-4-yl)ethyl)-5,6,7,8-tetrahydro-4H-thieno[3,2-c]azepin-4-one | US10604531, Example 1
Type:
Small organic molecule
Emp. Form.:
C29H43N3O2S
Mol. Mass.:
497.736
SMILES:
C[C@H](C1CCN(CC(C)(C)C)CC1)c1sc2CCCN(Cc3c(C)cc(C)[nH]c3=O)C(=O)c2c1C
: