Target
Beta-secretase 1
Ligand
BDBM439198
Substrate
Meas. Tech.
HTRF FRET Assay
Ki
3.40±n/a nM
Citation
 Walsh, SPCumming, JNDai, X C5-C6-oxacyclic fused iminothiadiazine dioxide compounds bearing an ether linker as BACE inhibitors, compositions, and their use US Patent  US10604534 Publication Date 3/31/2020 
Target
Name:
Beta-secretase 1
Synonyms:
ASP2 Aspartyl protease 2 BACE1 Beta-secretase (BACE) Beta-secretase 1 (BACE 1) Beta-secretase 1 (BACE1) Beta-site amyloid precursor protein cleaving enzyme 1 Memapsin-2 beta-Secretase (BACE-1) | beta-Secretase (BACE1)
Type:
Protein
Mol. Mass.:
55755.10
Organism:
Homo sapiens (Human)
Description:
P56817
Residue:
501
  
Inhibitor
Name:
BDBM439198
Synonyms:
US10604534, Example 1
Type:
Small organic molecule
Emp. Form.:
C19H20F2N4O4S
Mol. Mass.:
438.448
SMILES:
C[C@H]1C[C@@H]2[C@](CO1)(NC(=N)N(C)S2(=O)=O)c1cc(Oc2ncccc2F)ccc1F
: