Target
Beta-secretase 2
Ligand
BDBM439202
Substrate
Meas. Tech.
Time-Resolved Endpoint Proteolysis Assay
Ki
13.0±n/a nM
Citation
 Walsh, SPCumming, JNDai, X C5-C6-oxacyclic fused iminothiadiazine dioxide compounds bearing an ether linker as BACE inhibitors, compositions, and their use US Patent  US10604534 Publication Date 3/31/2020 
Target
Name:
Beta-secretase 2
Synonyms:
AEPLC ASP1 Asp 1 Aspartyl protease 1 BACE2_HUMAN Beta-secretase (BACE) Beta-secretase 2 (BACE-2) Beta-site APP-cleaving enzyme 2 Memapsin-1 beta-Secretase (BACE-2)
Type:
Protein
Mol. Mass.:
56171.20
Organism:
Homo sapiens (Human)
Description:
Q9Y5Z0
Residue:
518
  
Inhibitor
Name:
BDBM439202
Synonyms:
US10604534, Example 5
Type:
Small organic molecule
Emp. Form.:
C19H19F3N4O4S
Mol. Mass.:
456.439
SMILES:
C[C@H]1C[C@@H]2[C@](CO1)(NC(=N)N(C)S2(=O)=O)c1cc(Oc2ncc(F)cc2F)ccc1F
: