Target
Receptor-interacting serine/threonine-protein kinase 1
Ligand
BDBM356286
Substrate
Meas. Tech.
Fluorescent Polarization Binding Assay
IC50
<1000±n/a nM
Citation
 Estrada, AAFeng, JAFox, BLeslie, CPLyssikatos, JPPozzan, ASweeney, ZKde Vicente Fidalgo, J Compounds, compositions and methods US Patent  US10604535 Publication Date 3/31/2020 
Target
Name:
Receptor-interacting serine/threonine-protein kinase 1
Synonyms:
Cell death protein RIP RIP-1 RIPK1 Receptor-interacting protein 1
Type:
Enzyme Catalytic Domain
Mol. Mass.:
75926.99
Organism:
Homo sapiens (Human)
Description:
Q13546
Residue:
671
  
Inhibitor
Name:
BDBM356286
Synonyms:
US10604535, Example 57 US9896458, No. 57
Type:
Small organic molecule
Emp. Form.:
C19H16FN5O3
Mol. Mass.:
381.3604
SMILES:
Fc1cn(Cc2ccccc2)nc1C(=O)N[C@H]1COc2cccnc2NC1=O
: