Target
Receptor-interacting serine/threonine-protein kinase 1
Ligand
BDBM439446
Substrate
Meas. Tech.
Fluorescent Polarization Binding Assay
IC50
<1000±n/a nM
Citation
 Estrada, AAFeng, JAFox, BLeslie, CPLyssikatos, JPPozzan, ASweeney, ZKde Vicente Fidalgo, J Compounds, compositions and methods US Patent  US10604535 Publication Date 3/31/2020 
Target
Name:
Receptor-interacting serine/threonine-protein kinase 1
Synonyms:
Cell death protein RIP RIP-1 RIPK1 Receptor-interacting protein 1
Type:
Enzyme Catalytic Domain
Mol. Mass.:
75926.99
Organism:
Homo sapiens (Human)
Description:
Q13546
Residue:
671
  
Inhibitor
Name:
BDBM439446
Synonyms:
US10604535, Example 126
Type:
Small organic molecule
Emp. Form.:
C20H18FN5O3
Mol. Mass.:
395.387
SMILES:
CN1c2ncccc2OC[C@H](NC(=O)c2nc(F)c(Cc3ccccc3)[nH]2)C1=O
: