Target
cAMP and cAMP-inhibited cGMP 3',5'-cyclic phosphodiesterase 10A
Ligand
BDBM397931
Substrate
Meas. Tech.
Fluorescence Polarization assay
IC50
<10±n/a nM
Citation
 Campbell, JEJones, PGMalcolm, S Substituted cyclopropanes as PDE-10 inhibitors US Patent  US10604536 Publication Date 3/31/2020 
Target
Name:
cAMP and cAMP-inhibited cGMP 3',5'-cyclic phosphodiesterase 10A
Synonyms:
3',5'-cyclic phosphodiesterase PDE10A Phosphodiesterase 10 (PDE10) | Phosphodiesterase 10A
Type:
Protein
Mol. Mass.:
88412.52
Organism:
Homo sapiens (Human)
Description:
Q9Y233
Residue:
1055
  
Inhibitor
Name:
BDBM397931
Synonyms:
US10604536, Compound 3 | US9994590, Compound 3
Type:
Small organic molecule
Emp. Form.:
C22H20N6
Mol. Mass.:
368.4344
SMILES:
Cc1c(nc2c3ccccc3ccn12)C1CC1c1nc2c(C)ncc(C)n2n1
: