Target
cAMP and cAMP-inhibited cGMP 3',5'-cyclic phosphodiesterase 10A
Ligand
BDBM397981
Substrate
Meas. Tech.
Fluorescence Polarization assay
IC50
55±n/a nM
Citation
 Campbell, JEJones, PGMalcolm, S Substituted cyclopropanes as PDE-10 inhibitors US Patent  US10604536 Publication Date 3/31/2020 
Target
Name:
cAMP and cAMP-inhibited cGMP 3',5'-cyclic phosphodiesterase 10A
Synonyms:
3',5'-cyclic phosphodiesterase PDE10A Phosphodiesterase 10 (PDE10) | Phosphodiesterase 10A
Type:
Protein
Mol. Mass.:
88412.52
Organism:
Homo sapiens (Human)
Description:
Q9Y233
Residue:
1055
  
Inhibitor
Name:
BDBM397981
Synonyms:
US10604536, Compound 54 | US9994590, Compound 53
Type:
Small organic molecule
Emp. Form.:
C20H22N6O
Mol. Mass.:
362.4283
SMILES:
[H][C@]1(C[C@@]1([H])c1nc2c(OC)cc(C)cn2c1C)c1nc2c(C)ncc(C)n2n1
: