Target
Protein arginine N-methyltransferase 5
Ligand
BDBM297732
Substrate
Meas. Tech.
PRMT5 Biochemical Assay
IC50
550±n/a nM
Citation
 Duncan, KWChesworth, RBoriack-Sjodin, PAMunchhof, MJ PRMT5 inhibitors and uses thereof US Patent  US10118918 Publication Date 11/6/2018 
Target
Name:
Protein arginine N-methyltransferase 5
Synonyms:
72 kDa ICln-binding protein HRMT1L5 IBP72 Jak-binding protein 1 PRMT5/MEP50 complex Protein arginine methyltransferase 5 (PRMT5) SKB1 homolog Shk1 kinase-binding protein 1 homolog
Type:
Enzyme
Mol. Mass.:
72679.99
Organism:
Homo sapiens (Human)
Description:
O14744
Residue:
637
  
Inhibitor
Name:
BDBM297732
Synonyms:
US10118918, Compound 11 tert-butyl (3-((2-hydroxy-3-(isoindolin-2-yl)propyl)carbamoyl)phenyl)carbamate
Type:
Small organic molecule
Emp. Form.:
C23H29N3O4
Mol. Mass.:
411.4941
SMILES:
CC(C)(C)OC(=O)Nc1cccc(c1)C(=O)NCC(O)CN1Cc2ccccc2C1
: