Target
Calmodulin-domain protein kinase 1
Ligand
BDBM416590
Substrate
Meas. Tech.
Enzymatic Inhibition Assay
IC50
6.10±n/a nM
Citation
 Hol, WGLarson, ETMaly, DJVan Voorhis, WCMerritt, EOjo, KK Compositions and methods for treating toxoplasmosis, cryptosporidiosis and other apicomplexan protozoan related diseases US Patent  US10632122 Publication Date 4/28/2020 
Target
Name:
Calmodulin-domain protein kinase 1
Synonyms:
Calmodulin-domain protein kinase 1 Calmodulin-domain protein kinase, putative
Type:
Enzyme Catalytic Domain
Mol. Mass.:
57248.42
Organism:
Toxoplasma gondii
Description:
Residue:
507
  
Inhibitor
Name:
BDBM416590
Synonyms:
1-((4-amino-3-(2-cyclopropoxyquinolin-6-yl)-1H-pyrazolo[3,4-d]pyrimidin-1-yl)methyl)cyclobutanol US10632122, Example 57
Type:
Small organic molecule
Emp. Form.:
C22H22N6O2
Mol. Mass.:
402.4491
SMILES:
Nc1ncnc2n(CC3(O)CCC3)nc(-c3ccc4nc(OC5CC5)ccc4c3)c12
: