Target
Fibroblast growth factor receptor 3
Ligand
BDBM261995
Substrate
Meas. Tech.
Enzymatic Assay
IC50
<10±n/a nM
Citation
 Sokolsky, AWu, LYao, W Bicyclic heterocycles as FGFR4 inhibitors US Patent  US10632126 Publication Date 4/28/2020 
Target
Name:
Fibroblast growth factor receptor 3
Synonyms:
CD_antigen: CD333 FGFR3 Fibroblast growth factor receptor JTK4
Type:
Protein
Mol. Mass.:
87699.57
Organism:
Homo sapiens (Human)
Description:
P22607
Residue:
806
  
Inhibitor
Name:
BDBM261995
Synonyms:
3-(2,6-difluoro-3,5- dimethoxyphenyl)-7-(1,3- dimethyl-1H-pyrazol-4-yl)-1- (pyridin-2-ylmethyl)-3,4- dihydropyrido[4,3-d]pyrimidin- 2(1H)-one US10632126, Example 94 US9708318, 94
Type:
Small organic molecule
Emp. Form.:
C26H24F2N6O3
Mol. Mass.:
506.504
SMILES:
COc1cc(OC)c(F)c(N2Cc3cnc(cc3N(Cc3ccccn3)C2=O)-c2cn(C)nc2C)c1F
: