Target
Fibroblast growth factor receptor 2
Ligand
BDBM262026
Substrate
Meas. Tech.
Enzymatic Assay
IC50
<10±n/a nM
Citation
 Sokolsky, AWu, LYao, W Bicyclic heterocycles as FGFR4 inhibitors US Patent  US10632126 Publication Date 4/28/2020 
Target
Name:
Fibroblast growth factor receptor 2
Synonyms:
BEK FGFR-2 FGFR2 Fibroblast growth factor receptor 2 (FGFR2) KGFR Keratinocyte growth factor receptor VEGF-receptor 2 and Fibroblast growth factor receptor 2
Type:
Enzyme
Mol. Mass.:
92015.45
Organism:
Homo sapiens (Human)
Description:
P21802
Residue:
821
  
Inhibitor
Name:
BDBM262026
Synonyms:
3-(2,6-difluoro-3,5-dimethoxyphenyl)-7-(1,3-dimethyl-1H-pyrazol-4-yl)-1-(1H-indazol-5-yl)-3,4-dihydropyrido[4,3-d]pyrimidin-2(1H)-one US10632126, Example 134 US9708318, 134
Type:
Small organic molecule
Emp. Form.:
C27H23F2N7O3
Mol. Mass.:
531.5134
SMILES:
COc1cc(OC)c(F)c(N2Cc3cnc(cc3N(C2=O)c2ccc3[nH]ncc3c2)-c2cn(C)nc2C)c1F
: