Target
Melanocortin receptor 4
Ligand
BDBM135723
Substrate
Meas. Tech.
Competitive Inhibition Assay
Ki
26.0±n/a nM
Citation
 Shi, YSharma, SDDodd, JHYang, WChen, X Melanocortin receptor-specific peptides US Patent  US10632171 Publication Date 4/28/2020 
Target
Name:
Melanocortin receptor 4
Synonyms:
MC4-R MC4R_HUMAN Melanocortin receptor 4 (MC-4) Melanocortin receptor 4 (MC4R)
Type:
Enzyme
Mol. Mass.:
36949.50
Organism:
Homo sapiens (Human)
Description:
P32245
Residue:
332
  
Inhibitor
Name:
BDBM135723
Synonyms:
US10179804, Example 108 US8846601, 108 | US9458201, 108
Type:
Small organic molecule
Emp. Form.:
C52H75N17O10
Mol. Mass.:
1098.2598
SMILES:
CC(=O)N[C@@H](CCCNC(N)=N)C(=O)N[C@H]1CCC(=O)NCCC[C@H](NC(=O)[C@H](Cc2c[nH]c3ccccc23)NC(=O)[C@H](CCCNC(N)=N)NC(=O)[C@@H](Cc2ccccc2)NC(=O)[C@H](CCC(N)=O)NC1=O)C(=O)NC1CC1
: